{"text_format":"1","workbook":"xlsx","n_sheets":6,"sheets":["For Office Use Only","Registration","Print Instructions","Student Roster","Event Registrations","Workshop Registrations"],"not_rendered":{"charts":0,"images":3,"macros":1,"external_links":0,"defined_names":11,"comments":0,"pivot_tables":0},"unopened":[],"bounds":{"document_bytes":16777216,"sheet_cells":100000,"rows_first":2000,"rows_last":500,"rows_between":2000,"halvings":0,"cell_chars":16384,"cell_head_chars":4096},"cells_cut":0,"cells_raw":0,"read":"whole","date_system":"1900"}

{"sheet":"For Office Use Only","index":0,"n_rows":88,"n_cols":9,"rows_kept":88,"cut":false,"hidden":true,"merged":[]}
[1,"1000 Alamance Community College",1000,null,"  ",null,null,null,"Select One:"]
[2,"1100 Alamance Community College - Career College",1100,null,1,"AM Arboriculture: Classroom (3hr)",null,null,"S"]
[3,"1200 Auburn University",1200,null,2,"AM Arboriculture: Hands-On (3hr)",null,null,"M"]
[4,"1300 Brigham Young University - Idaho",1300,null,3,"AM Computer Aided Landscape Design (3hr)",null,null,"L"]
[5,"1400 Brigham Young University - Provo",1400,null,4,"AM Hardscape Installation (3hr)",null,null,"XL"]
[6,"1500 Cal Poly - Pomona",1500,null,5,"AM Irrigation 101:  Irrigation Hands-on (3hr)",null,null,"XXL"]
[7,"1600 Cal Poly - San Luis Obispo",1600,null,6,"AM Irrigation 201:  Principles of Design (3hr)",null,null,"XXXL"]
[8,"1700 Carteret Community College",1700,null,7,"AM Landscape Lighting (3hr)"]
[9,"1800 Chattahoochee Technical College",1800,null,8,"AM Truck and Trailer Operation (3hr)"]
[10,"1900 Cincinnati State Tech. & Comm. College",1900,null,9,"AM Woody Ornamental Plant ID (3hr)"]
[11,"2000 Clackamas Community College",2000,null,10,"AM Compact Track/Skid Steer Loader Operation (Session 1)"]
[12,"2100 Clemson University",2100,null,11,"AM Construction Cost Estimating (Session 1)"]
[13,"2200 College of DuPage",2200,null,12,"AM NALPF/KFF Business Track - Customer Mgmt / Busn Development (Session 1)"]
[14,"2300 College of Western Idaho",2300,null,13,"AM Safety First (Session 1)"]
[15,"2400 Colorado State University",2400,null,14,"AM Sales Presentation (Session 1)"]
[16,"2500 Columbus State Community College",2500,null,15,"AM Small Engine Repair (Session 1)"]
[17,"2600 County College of Morrie",2600,null,16,"AM Climate Change & Arboriculture: As Earth Warms, Trees Feel the Heat (Session 2)"]
[18,"2700 Cuyahoga Community College",2700,null,17,"AM Construction Cost Estimating (Session 2)"]
[19,"2800 Cuyamaca College",2800,null,18,"AM Power Management (Session 2)"]
[20,"2900 Eastern Kentucky University",2900,null,19,"AM Pruning (Session 2)"]
{"$rows_left_out":69}
{"sheet":"Registration","index":1,"n_rows":110,"n_cols":39,"rows_kept":110,"cut":false,"hidden":false,"merged":[[3,9,3,10],[0,9,0,10]]}
[]
["2024 National Collegiate Landscape Competition Registration Form"]
[null,null,null,null,null,null,null,null,null,"* If your school does not appear in the list, select 9900 from the list and enter your school name here:"]
["Select Your School: ",3,null,null,null,null,null,null,null,null,null,null,null,null,null,null,null,null,null,"Registration Data: Copy & Paste as Values",null,null,null,null,null,null,null,null,null,"Event Registration Data: Copy & Paste as Values First",null,null,null,null,"Workshop Registrations: Copy & Paste as Values First"]
[1,{"$f":"INDEX('For Office Use Only'!A1:B89,A5,0)","v":"1000 Alamance Community College"}]
[null,{"$f":"VLOOKUP(A5, 'For Office Use Only'!A1:C89, 3, FALSE)","v":1000}]
["Student Roster",null,null,null,null,null,null,null,null,"Event Registration",null,null,null,null,null,"Workshop Registrations"]
[null,null,null,null,null,null,null,null,null,"Events in Blue REQUIRE TWO Students per School"]
[null,null,null,null,"Faculty","T-Shirt","Graduation","Opt-In Free",null,null,null,null,null,null,null,null,null,null,null,null,null,null,null,null,null,null,null,"DO NOT COPY",null,"DO NOT COPY",null,null,null,null,"DO NOT COPY","DO NOT COPY"]
["Student No.","First Name","Last Name","Email Address","Indicator (X)","Size","Date","NALP Membership",null,"Event Description","Participating Student",null,null,null,null,"Select Workshop:","Select Student:",null,null,"StudentID","UnivID","FirstName","LastName","Fac Ind","Email Address","TShirtSize","OptIn","Name for Lookup",null,"Student","StudentID","EventID","UniversityID",null,"Workshop","Student","StudentID","WorkshopID","UniversityID"]
[null,"First Name Here","Last Name Here","jstudent@school.edu","X",null,null,"X",1,"3D Exterior Landscape Design",null,null,null,null,null,null,null,null,null,null,null,null,null,null,null,null,null,null,null,null,{"$f":"AD11+AG11","v":1000},1,{"$f":"$B$6","v":1000},null,null,null,{"$f":"$B$6+AJ11","v":1000},{"$f":"AI11","v":0},{"$f":"$B$6","v":1000}]
[{"$f":"B6+1","v":1001},null,null,null,null,1,null,null,null,null,null,null,null,null,null,null,null,null,null,{"$f":"A12","v":1001},{"$f":"$B$6","v":1000},{"$f":"B12","v":0},{"$f":"C12","v":0},{"$f":"IF(E12=\"X\",1,0)","v":0},{"$f":"D12","v":0},{"$f":"IF(F12=2,\"S\",IF(F12=3,\"M\",IF(F12=4,\"L\",IF(F12=5,\"XL\",IF(F12=6,\"XXL\",IF(F12=7,\"XXXL\"))))))","v":false},{"$f":"IF(H12=\"x\",1,0)","v":0},{"$f":"A12&\" \"&B12&\" \"&C12","v":"1001  "},null,null,null,null,null,null,null,null,{"$f":"$B$6+AJ12","v":1000},{"$f":"AI12","v":0},{"$f":"$B$6","v":1000}]
[{"$f":"B6+2","v":1002},null,null,null,null,1,null,null,2,"Annual & Perennial Identification",null,null,null,null,null,null,null,null,null,{"$f":"A13","v":1002},{"$f":"$B$6","v":1000},{"$f":"B13","v":0},{"$f":"C13","v":0},{"$f":"IF(E13=\"X\",1,0)","v":0},{"$f":"D13","v":0},{"$f":"IF(F13=2,\"S\",IF(F13=3,\"M\",IF(F13=4,\"L\",IF(F13=5,\"XL\",IF(F13=6,\"XXL\",IF(F13=7,\"XXXL\"))))))","v":false},{"$f":"IF(H13=\"x\",1,0)","v":0},{"$f":"A13&\" \"&B13&\" \"&C13","v":"1002  "},null,null,{"$f":"AD13+AG13","v":1000},2,{"$f":"$B$6","v":1000},null,null,null,1000,0,1000]
[{"$f":"B6+3","v":1003},null,null,null,null,1,null,null,2,"Annual & Perennial Identification",null,null,null,null,null,null,null,null,null,1003,1000,0,0,0,0,false,0,"1003  ",null,null,1000,2,1000,null,null,null,1000,0,1000]
[{"$f":"B6+4","v":1004},null,null,null,null,1,null,null,null,null,null,null,null,null,null,null,null,null,null,1004,1000,0,0,0,0,false,0,"1004  ",null,null,null,null,null,null,null,null,1000,0,1000]
[{"$f":"B6+5","v":1005},null,null,null,null,1,null,null,3,"Arboriculture Techniques",null,null,null,null,null,null,null,null,null,1005,1000,{"$f":"B16","v":0},0,0,{"$f":"D16","v":0},false,0,{"$f":"A16&\" \"&B16&\" \"&C16","v":"1005  "},null,null,1000,3,1000,null,null,null,1000,0,1000]
[{"$f":"B6+6","v":1006},null,null,null,null,1,null,null,3,"Arboriculture Techniques",null,null,null,null,null,null,null,null,null,1006,1000,0,0,0,0,false,0,"1006  ",null,null,1000,3,1000,null,null,null,1000,0,1000]
[{"$f":"B6+7","v":1007},null,null,null,null,1,null,null,null,null,null,null,null,null,null,null,null,null,null,1007,1000,0,0,0,0,false,0,"1007  ",null,null,null,null,null,null,null,null,1000,0,1000]
[{"$f":"B6+8","v":1008},null,null,null,null,1,null,null,4,"Business Management",null,null,null,null,null,null,null,null,null,1008,1000,0,0,0,0,false,0,"1008  ",null,null,1000,4,1000,null,null,null,1000,0,1000]
[{"$f":"B6+9","v":1009},null,null,null,null,1,null,null,4,"Business Management",null,null,null,null,null,null,null,null,null,1009,1000,0,0,0,0,false,0,"1009  ",null,null,1000,4,1000,null,null,null,1000,0,1000]
{"$rows_left_out":91}
{"sheet":"Print Instructions","index":2,"n_rows":49,"n_cols":1,"rows_kept":49,"cut":false,"hidden":true,"merged":[]}
["1. Select desired section from the Name Range option box."]
[]
[]
[]
[]
[]
[]
[]
[]
[]
[]
[]
[]
[]
[]
[]
[]
[]
[]
[]
{"$rows_left_out":30}
{"sheet":"Student Roster","index":3,"n_rows":104,"n_cols":5,"rows_kept":104,"cut":false,"hidden":true,"merged":[]}
[]
["2018 National Collegiate Landscape Competition Student Roster"]
[{"$f":"Registration!B5","v":"1000 Alamance Community College"}]
[]
["ID","Name","Fac Ind","T Shirt","Email Address"]
[{"$f":"Registration!A12","v":1001},{"$f":"Registration!B12&\" \"&Registration!C12","v":" "},{"$f":"IF(Registration!E12=\"X\",\"Faculty\",\"\")","v":""},{"$f":"IF(Registration!#REF!=2,\"S\",IF(Registration!#REF!=3,\"M\",IF(Registration!#REF!=4,\"L\",IF(Registration!#REF!=5,\"XL\",IF(Registration!#REF!=6,\"XXL\",IF(Registration!#REF!=7,\"XXXL\",\"\"))))))","v":{"$error":"#REF!"}},{"$f":"IF(Registration!D11=\"\",\"\",Registration!D11)","v":"jstudent@school.edu"}]
[{"$f":"Registration!A13","v":1002},{"$f":"Registration!B13&\" \"&Registration!C13","v":" "},{"$f":"IF(Registration!E13=\"X\",\"Faculty\",\"\")","v":""},{"$f":"IF(Registration!#REF!=2,\"S\",IF(Registration!#REF!=3,\"M\",IF(Registration!#REF!=4,\"L\",IF(Registration!#REF!=5,\"XL\",IF(Registration!#REF!=6,\"XXL\",IF(Registration!#REF!=7,\"XXXL\",\"\"))))))","v":{"$error":"#REF!"}},{"$f":"IF(Registration!D13=\"\",\"\",Registration!D13)","v":""}]
[{"$f":"Registration!A14","v":1003},{"$f":"Registration!B14&\" \"&Registration!C14","v":" "},{"$f":"IF(Registration!E14=\"X\",\"Faculty\",\"\")","v":""},{"$f":"IF(Registration!#REF!=2,\"S\",IF(Registration!#REF!=3,\"M\",IF(Registration!#REF!=4,\"L\",IF(Registration!#REF!=5,\"XL\",IF(Registration!#REF!=6,\"XXL\",IF(Registration!#REF!=7,\"XXXL\",\"\"))))))","v":{"$error":"#REF!"}},{"$f":"IF(Registration!D14=\"\",\"\",Registration!D14)","v":""}]
[{"$f":"Registration!A15","v":1004},{"$f":"Registration!B15&\" \"&Registration!C15","v":" "},{"$f":"IF(Registration!E15=\"X\",\"Faculty\",\"\")","v":""},{"$f":"IF(Registration!#REF!=2,\"S\",IF(Registration!#REF!=3,\"M\",IF(Registration!#REF!=4,\"L\",IF(Registration!#REF!=5,\"XL\",IF(Registration!#REF!=6,\"XXL\",IF(Registration!#REF!=7,\"XXXL\",\"\"))))))","v":{"$error":"#REF!"}},{"$f":"IF(Registration!D15=\"\",\"\",Registration!D15)","v":""}]
[{"$f":"Registration!A16","v":1005},{"$f":"Registration!B16&\" \"&Registration!C16","v":" "},{"$f":"IF(Registration!E16=\"X\",\"Faculty\",\"\")","v":""},{"$f":"IF(Registration!#REF!=2,\"S\",IF(Registration!#REF!=3,\"M\",IF(Registration!#REF!=4,\"L\",IF(Registration!#REF!=5,\"XL\",IF(Registration!#REF!=6,\"XXL\",IF(Registration!#REF!=7,\"XXXL\",\"\"))))))","v":{"$error":"#REF!"}},{"$f":"IF(Registration!D16=\"\",\"\",Registration!D16)","v":""}]
[{"$f":"Registration!A17","v":1006},{"$f":"Registration!B17&\" \"&Registration!C17","v":" "},{"$f":"IF(Registration!E17=\"X\",\"Faculty\",\"\")","v":""},{"$f":"IF(Registration!#REF!=2,\"S\",IF(Registration!#REF!=3,\"M\",IF(Registration!#REF!=4,\"L\",IF(Registration!#REF!=5,\"XL\",IF(Registration!#REF!=6,\"XXL\",IF(Registration!#REF!=7,\"XXXL\",\"\"))))))","v":{"$error":"#REF!"}},{"$f":"IF(Registration!D17=\"\",\"\",Registration!D17)","v":""}]
[{"$f":"Registration!A18","v":1007},{"$f":"Registration!B18&\" \"&Registration!C18","v":" "},{"$f":"IF(Registration!E18=\"X\",\"Faculty\",\"\")","v":""},{"$f":"IF(Registration!#REF!=2,\"S\",IF(Registration!#REF!=3,\"M\",IF(Registration!#REF!=4,\"L\",IF(Registration!#REF!=5,\"XL\",IF(Registration!#REF!=6,\"XXL\",IF(Registration!#REF!=7,\"XXXL\",\"\"))))))","v":{"$error":"#REF!"}},{"$f":"IF(Registration!D18=\"\",\"\",Registration!D18)","v":""}]
[{"$f":"Registration!A19","v":1008},{"$f":"Registration!B19&\" \"&Registration!C19","v":" "},{"$f":"IF(Registration!E19=\"X\",\"Faculty\",\"\")","v":""},{"$f":"IF(Registration!#REF!=2,\"S\",IF(Registration!#REF!=3,\"M\",IF(Registration!#REF!=4,\"L\",IF(Registration!#REF!=5,\"XL\",IF(Registration!#REF!=6,\"XXL\",IF(Registration!#REF!=7,\"XXXL\",\"\"))))))","v":{"$error":"#REF!"}},{"$f":"IF(Registration!D19=\"\",\"\",Registration!D19)","v":""}]
[{"$f":"Registration!A20","v":1009},{"$f":"Registration!B20&\" \"&Registration!C20","v":" "},{"$f":"IF(Registration!E20=\"X\",\"Faculty\",\"\")","v":""},{"$f":"IF(Registration!#REF!=2,\"S\",IF(Registration!#REF!=3,\"M\",IF(Registration!#REF!=4,\"L\",IF(Registration!#REF!=5,\"XL\",IF(Registration!#REF!=6,\"XXL\",IF(Registration!#REF!=7,\"XXXL\",\"\"))))))","v":{"$error":"#REF!"}},{"$f":"IF(Registration!D20=\"\",\"\",Registration!D20)","v":""}]
[{"$f":"Registration!A21","v":1010},{"$f":"Registration!B21&\" \"&Registration!C21","v":" "},{"$f":"IF(Registration!E21=\"X\",\"Faculty\",\"\")","v":""},{"$f":"IF(Registration!#REF!=2,\"S\",IF(Registration!#REF!=3,\"M\",IF(Registration!#REF!=4,\"L\",IF(Registration!#REF!=5,\"XL\",IF(Registration!#REF!=6,\"XXL\",IF(Registration!#REF!=7,\"XXXL\",\"\"))))))","v":{"$error":"#REF!"}},{"$f":"IF(Registration!D21=\"\",\"\",Registration!D21)","v":""}]
[{"$f":"Registration!A22","v":1011},{"$f":"Registration!B22&\" \"&Registration!C22","v":" "},{"$f":"IF(Registration!E22=\"X\",\"Faculty\",\"\")","v":""},{"$f":"IF(Registration!#REF!=2,\"S\",IF(Registration!#REF!=3,\"M\",IF(Registration!#REF!=4,\"L\",IF(Registration!#REF!=5,\"XL\",IF(Registration!#REF!=6,\"XXL\",IF(Registration!#REF!=7,\"XXXL\",\"\"))))))","v":{"$error":"#REF!"}},{"$f":"IF(Registration!D22=\"\",\"\",Registration!D22)","v":""}]
[{"$f":"Registration!A23","v":1012},{"$f":"Registration!B23&\" \"&Registration!C23","v":" "},{"$f":"IF(Registration!E23=\"X\",\"Faculty\",\"\")","v":""},{"$f":"IF(Registration!#REF!=2,\"S\",IF(Registration!#REF!=3,\"M\",IF(Registration!#REF!=4,\"L\",IF(Registration!#REF!=5,\"XL\",IF(Registration!#REF!=6,\"XXL\",IF(Registration!#REF!=7,\"XXXL\",\"\"))))))","v":{"$error":"#REF!"}},{"$f":"IF(Registration!D23=\"\",\"\",Registration!D23)","v":""}]
[{"$f":"Registration!A24","v":1013},{"$f":"Registration!B24&\" \"&Registration!C24","v":" "},{"$f":"IF(Registration!E24=\"X\",\"Faculty\",\"\")","v":""},{"$f":"IF(Registration!#REF!=2,\"S\",IF(Registration!#REF!=3,\"M\",IF(Registration!#REF!=4,\"L\",IF(Registration!#REF!=5,\"XL\",IF(Registration!#REF!=6,\"XXL\",IF(Registration!#REF!=7,\"XXXL\",\"\"))))))","v":{"$error":"#REF!"}},{"$f":"IF(Registration!D24=\"\",\"\",Registration!D24)","v":""}]
[{"$f":"Registration!A25","v":1014},{"$f":"Registration!B25&\" \"&Registration!C25","v":" "},{"$f":"IF(Registration!E25=\"X\",\"Faculty\",\"\")","v":""},{"$f":"IF(Registration!#REF!=2,\"S\",IF(Registration!#REF!=3,\"M\",IF(Registration!#REF!=4,\"L\",IF(Registration!#REF!=5,\"XL\",IF(Registration!#REF!=6,\"XXL\",IF(Registration!#REF!=7,\"XXXL\",\"\"))))))","v":{"$error":"#REF!"}},{"$f":"IF(Registration!D25=\"\",\"\",Registration!D25)","v":""}]
[{"$f":"Registration!A26","v":1015},{"$f":"Registration!B26&\" \"&Registration!C26","v":" "},{"$f":"IF(Registration!E26=\"X\",\"Faculty\",\"\")","v":""},{"$f":"IF(Registration!#REF!=2,\"S\",IF(Registration!#REF!=3,\"M\",IF(Registration!#REF!=4,\"L\",IF(Registration!#REF!=5,\"XL\",IF(Registration!#REF!=6,\"XXL\",IF(Registration!#REF!=7,\"XXXL\",\"\"))))))","v":{"$error":"#REF!"}},{"$f":"IF(Registration!D26=\"\",\"\",Registration!D26)","v":""}]
{"$rows_left_out":85}
{"sheet":"Event Registrations","index":4,"n_rows":85,"n_cols":2,"rows_kept":85,"cut":false,"hidden":true,"merged":[]}
[]
["2018 National Collegiate Landscape Competition Event Registration"]
[{"$f":"Registration!B5","v":"1000 Alamance Community College"}]
[]
["Event Registration"]
["Event Description","Participating Student"]
[{"$f":"Registration!J11","v":"3D Exterior Landscape Design"},{"$f":"IF(ISNA(VLOOKUP(Registration!O11,Registration!A12:F110,8,FALSE)),\"\",VLOOKUP(Registration!O11,Registration!A12:F110,8,FALSE))","v":""}]
[]
[{"$f":"Registration!J13","v":"Annual & Perennial Identification"},{"$f":"IF(ISNA(VLOOKUP(Registration!O13,Registration!A12:F110,8,FALSE)),\"\",VLOOKUP(Registration!O13,Registration!A12:F110,8,FALSE))","v":""}]
[{"$f":"Registration!J14","v":"Annual & Perennial Identification"},{"$f":"IF(ISNA(VLOOKUP(Registration!O14,Registration!A12:F110,8,FALSE)),\"\",VLOOKUP(Registration!O14,Registration!A12:F110,8,FALSE))","v":""}]
[]
[{"$f":"Registration!J16","v":"Arboriculture Techniques"},{"$f":"IF(ISNA(VLOOKUP(Registration!O16,Registration!A12:F110,8,FALSE)),\"\",VLOOKUP(Registration!O16,Registration!A12:F110,8,FALSE))","v":""}]
[{"$f":"Registration!J17","v":"Arboriculture Techniques"},{"$f":"IF(ISNA(VLOOKUP(Registration!O17,Registration!A12:F110,8,FALSE)),\"\",VLOOKUP(Registration!O17,Registration!A12:F110,8,FALSE))","v":""}]
[]
[{"$f":"Registration!J19","v":"Business Management"},{"$f":"IF(ISNA(VLOOKUP(Registration!O19,Registration!A12:F110,8,FALSE)),\"\",VLOOKUP(Registration!O19,Registration!A12:F110,8,FALSE))","v":""}]
[{"$f":"Registration!J20","v":"Business Management"},{"$f":"IF(ISNA(VLOOKUP(Registration!O20,Registration!A12:F110,8,FALSE)),\"\",VLOOKUP(Registration!O20,Registration!A12:F110,8,FALSE))","v":""}]
[]
[{"$f":"Registration!J22","v":"Compact Excavator Operation"},{"$f":"IF(ISNA(VLOOKUP(Registration!O22,Registration!A12:F110,8,FALSE)),\"\",VLOOKUP(Registration!O22,Registration!A12:F110,8,FALSE))","v":""}]
[]
[{"$f":"Registration!J24","v":"Compact Track/Skid Steer Loader Operation"},{"$f":"IF(ISNA(VLOOKUP(Registration!O24,Registration!A12:F110,8,FALSE)),\"\",VLOOKUP(Registration!O24,Registration!A12:F110,8,FALSE))","v":""}]
{"$rows_left_out":66}
{"sheet":"Workshop Registrations","index":5,"n_rows":107,"n_cols":2,"rows_kept":107,"cut":false,"hidden":true,"merged":[]}
[]
["2018 National Collegiate Landscape Competition Workshop Registration"]
[{"$f":"Registration!B5","v":"1000 Alamance Community College"}]
[]
["Workshop Registrations"]
["Workshop Registration","Participating Student"]
[{"$f":"IF(ISNA(VLOOKUP(Registration!#REF!,'For Office Use Only'!E2:F27,2,FALSE)),\"\",VLOOKUP(Registration!#REF!,'For Office Use Only'!E2:F27,2,FALSE))","v":{"$error":"#REF!"}},{"$f":"IF(ISNA(VLOOKUP(Registration!#REF!,Registration!A12:F110,8,FALSE)),\"\",VLOOKUP(Registration!#REF!,Registration!A12:F110,8,FALSE))","v":{"$error":"#REF!"}}]
[{"$f":"IF(ISNA(VLOOKUP(Registration!#REF!,'For Office Use Only'!E2:F27,2,FALSE)),\"\",VLOOKUP(Registration!#REF!,'For Office Use Only'!E2:F27,2,FALSE))","v":{"$error":"#REF!"}},{"$f":"IF(ISNA(VLOOKUP(Registration!#REF!,Registration!A12:F110,8,FALSE)),\"\",VLOOKUP(Registration!#REF!,Registration!A12:F110,8,FALSE))","v":{"$error":"#REF!"}}]
[{"$f":"IF(ISNA(VLOOKUP(Registration!#REF!,'For Office Use Only'!E2:F27,2,FALSE)),\"\",VLOOKUP(Registration!#REF!,'For Office Use Only'!E2:F27,2,FALSE))","v":{"$error":"#REF!"}},{"$f":"IF(ISNA(VLOOKUP(Registration!#REF!,Registration!A12:F110,8,FALSE)),\"\",VLOOKUP(Registration!#REF!,Registration!A12:F110,8,FALSE))","v":{"$error":"#REF!"}}]
[{"$f":"IF(ISNA(VLOOKUP(Registration!#REF!,'For Office Use Only'!E2:F27,2,FALSE)),\"\",VLOOKUP(Registration!#REF!,'For Office Use Only'!E2:F27,2,FALSE))","v":{"$error":"#REF!"}},{"$f":"IF(ISNA(VLOOKUP(Registration!#REF!,Registration!A12:F110,8,FALSE)),\"\",VLOOKUP(Registration!#REF!,Registration!A12:F110,8,FALSE))","v":{"$error":"#REF!"}}]
[{"$f":"IF(ISNA(VLOOKUP(Registration!#REF!,'For Office Use Only'!E2:F27,2,FALSE)),\"\",VLOOKUP(Registration!#REF!,'For Office Use Only'!E2:F27,2,FALSE))","v":{"$error":"#REF!"}},{"$f":"IF(ISNA(VLOOKUP(Registration!#REF!,Registration!A12:F110,8,FALSE)),\"\",VLOOKUP(Registration!#REF!,Registration!A12:F110,8,FALSE))","v":{"$error":"#REF!"}}]
[{"$f":"IF(ISNA(VLOOKUP(Registration!#REF!,'For Office Use Only'!E2:F27,2,FALSE)),\"\",VLOOKUP(Registration!#REF!,'For Office Use Only'!E2:F27,2,FALSE))","v":{"$error":"#REF!"}},{"$f":"IF(ISNA(VLOOKUP(Registration!#REF!,Registration!A12:F110,8,FALSE)),\"\",VLOOKUP(Registration!#REF!,Registration!A12:F110,8,FALSE))","v":{"$error":"#REF!"}}]
[{"$f":"IF(ISNA(VLOOKUP(Registration!#REF!,'For Office Use Only'!E2:F27,2,FALSE)),\"\",VLOOKUP(Registration!#REF!,'For Office Use Only'!E2:F27,2,FALSE))","v":{"$error":"#REF!"}},{"$f":"IF(ISNA(VLOOKUP(Registration!#REF!,Registration!A12:F110,8,FALSE)),\"\",VLOOKUP(Registration!#REF!,Registration!A12:F110,8,FALSE))","v":{"$error":"#REF!"}}]
[{"$f":"IF(ISNA(VLOOKUP(Registration!#REF!,'For Office Use Only'!E2:F27,2,FALSE)),\"\",VLOOKUP(Registration!#REF!,'For Office Use Only'!E2:F27,2,FALSE))","v":{"$error":"#REF!"}},{"$f":"IF(ISNA(VLOOKUP(Registration!#REF!,Registration!A12:F110,8,FALSE)),\"\",VLOOKUP(Registration!#REF!,Registration!A12:F110,8,FALSE))","v":{"$error":"#REF!"}}]
[{"$f":"IF(ISNA(VLOOKUP(Registration!#REF!,'For Office Use Only'!E2:F27,2,FALSE)),\"\",VLOOKUP(Registration!#REF!,'For Office Use Only'!E2:F27,2,FALSE))","v":{"$error":"#REF!"}},{"$f":"IF(ISNA(VLOOKUP(Registration!#REF!,Registration!A12:F110,8,FALSE)),\"\",VLOOKUP(Registration!#REF!,Registration!A12:F110,8,FALSE))","v":{"$error":"#REF!"}}]
[{"$f":"IF(ISNA(VLOOKUP(Registration!#REF!,'For Office Use Only'!E2:F27,2,FALSE)),\"\",VLOOKUP(Registration!#REF!,'For Office Use Only'!E2:F27,2,FALSE))","v":{"$error":"#REF!"}},{"$f":"IF(ISNA(VLOOKUP(Registration!#REF!,Registration!A12:F110,8,FALSE)),\"\",VLOOKUP(Registration!#REF!,Registration!A12:F110,8,FALSE))","v":{"$error":"#REF!"}}]
[{"$f":"IF(ISNA(VLOOKUP(Registration!#REF!,'For Office Use Only'!E2:F27,2,FALSE)),\"\",VLOOKUP(Registration!#REF!,'For Office Use Only'!E2:F27,2,FALSE))","v":{"$error":"#REF!"}},{"$f":"IF(ISNA(VLOOKUP(Registration!#REF!,Registration!A12:F110,8,FALSE)),\"\",VLOOKUP(Registration!#REF!,Registration!A12:F110,8,FALSE))","v":{"$error":"#REF!"}}]
[{"$f":"IF(ISNA(VLOOKUP(Registration!#REF!,'For Office Use Only'!E2:F27,2,FALSE)),\"\",VLOOKUP(Registration!#REF!,'For Office Use Only'!E2:F27,2,FALSE))","v":{"$error":"#REF!"}},{"$f":"IF(ISNA(VLOOKUP(Registration!#REF!,Registration!A12:F110,8,FALSE)),\"\",VLOOKUP(Registration!#REF!,Registration!A12:F110,8,FALSE))","v":{"$error":"#REF!"}}]
[{"$f":"IF(ISNA(VLOOKUP(Registration!#REF!,'For Office Use Only'!E2:F27,2,FALSE)),\"\",VLOOKUP(Registration!#REF!,'For Office Use Only'!E2:F27,2,FALSE))","v":{"$error":"#REF!"}},{"$f":"IF(ISNA(VLOOKUP(Registration!#REF!,Registration!A12:F110,8,FALSE)),\"\",VLOOKUP(Registration!#REF!,Registration!A12:F110,8,FALSE))","v":{"$error":"#REF!"}}]
[{"$f":"IF(ISNA(VLOOKUP(Registration!#REF!,'For Office Use Only'!E2:F27,2,FALSE)),\"\",VLOOKUP(Registration!#REF!,'For Office Use Only'!E2:F27,2,FALSE))","v":{"$error":"#REF!"}},{"$f":"IF(ISNA(VLOOKUP(Registration!#REF!,Registration!A12:F110,8,FALSE)),\"\",VLOOKUP(Registration!#REF!,Registration!A12:F110,8,FALSE))","v":{"$error":"#REF!"}}]
{"$rows_left_out":87}